Jump to content

Nginx 1.15.2 Fails to compile

   (0 reviews)

Administrator

Perl issue after a server upgrade on Bionic (Havent run on my other version test servers yet) when compiling Nginx with OpenSSL option.

rm -rf objs/install_perl
cc -c -fPIC -pipe -O -W -Wall -Wpointer-arith -Wno-unused-parameter -Werror -g -g -O2 -fstack-protector-strong -Wformat -Werror=format-security -Wp,-D_FORTIFY_SOURCE=2 -fwrapv -fno-strict-a$
        -o objs/src/http/modules/perl/ngx_http_perl_module.o \
        src/http/modules/perl/ngx_http_perl_module.c
cc -c -fPIC -pipe  -O -W -Wall -Wpointer-arith -Wno-unused-parameter -Werror -g -g -O2 -fstack-protector-strong -Wformat -Werror=format-security -Wp,-D_FORTIFY_SOURCE=2 -I src/core -I src/e$
        -o objs/ngx_http_perl_module_modules.o \
        objs/ngx_http_perl_module_modules.c
cc -o objs/ngx_http_perl_module.so \
objs/src/http/modules/perl/ngx_http_perl_module.o \
objs/ngx_http_perl_module_modules.o \
-Wl,-Bsymbolic-functions -Wl,-z,relro -Wl,--as-needed -Wl,-E -fstack-protector-strong -L/usr/local/lib -L/usr/local/lib/perl5/5.26.2/x86_64-linux/CORE -lperl -lpthread -lnsl -ldl -lm -lcryp$
-shared
/usr/bin/x86_64-linux-gnu-ld: /usr/local/lib/perl5/5.26.2/x86_64-linux/CORE/libperl.a(op.o): relocation R_X86_64_PC32 against symbol `PL_compcv' can not be used when making a shared object;$
/usr/bin/x86_64-linux-gnu-ld: final link failed: Bad value
collect2: error: ld returned 1 exit status
objs/Makefile:1889: recipe for target 'objs/ngx_http_perl_module.so' failed
make[1]: *** [objs/ngx_http_perl_module.so] Error 1
make[1]: Leaving directory '/opt/source/nginx-1.15.2'
Makefile:8: recipe for target 'build' failed
make: *** [build] Error 2


User Feedback

Create an account or sign in to leave a review

You need to be a member in order to leave a review

Create an account

Sign up for a new account in our community. It's easy!

Register a new account

Sign in

Already have an account? Sign in here.

Sign In Now

There are no reviews to display.


  • Recently Browsing   0 members

    No registered users viewing this page.

  • Who's Online (See full list)

    There are no registered users currently online

  • Definitions

    Reports

    Bug Report - Application Bug

    Security Report - Security Concern

    Problem - Account Problem

    Suggestion - Application Suggestions

    Question - Application Questions


    Status

    Pending - Unviewed Report

    Reviewing - Under Review

    Confirmed - Issue has been Confirmed

    Fixed - Issue has been Fixed

    Unknown - Cannot Reproduce

    Closed - Invalid/Duplicate

    Accepted - Accepted

    Answered - Answered

    Rejected - Rejected


    Development

    Enhancement - Enhancements

    Build - Application Build

    Beta - Beta Build

    Testing - Test Build

    Current - Current Build

    Release - Release Build

    Stable - Stable Build

    Update - Admin Note

    Active - Working

    Completed - Action Completed

    MASTER - Blaster

    - Pushed to GitHub

    Disable any 3rd parth plugins in your browser, clear cache and cookies, and perform necessary updates before submitting a bug .

×